J'ai besion d'aide quand je lance mon application sur flutter

FAILURE: Build failed with an exception.

  • What went wrong:
    Execution failed for task ‹ :app:desugarDebugFileDependencies ›.

A failure occurred while executing com.android.build.gradle.internal.tasks.Workers$ActionFacade
C:\Users\HEKIMA DivinGovernor\AppData\Local\Android\sdk\build-tools\28.0.3\core-lambda-stubs.jar

  • Try:
    Run with --stacktrace option to get the stack trace. Run with --info or --debug option to get more log output. Run with --scan to get full insights.

  • Get more help at https://help.gradle.org

BUILD FAILED in 5m 20s
Exception: Gradle task assembleDebug failed with exit code 1

Je suis nouvo, mais il te suggere :
Run with --info or --debug option to get more log output. Run with --scan to get full insights.
Donc, ptet que dans ton terminal tu peut en savoir plus en ajoutant :
Run with --info
etc…etc…

j’ai pas bien saisie mon frEre.Run

PS C:\Users\HEKIMA DivinGovernor\flutter_divin_first> Run with --info
Run : Le terme «Run» n’est pas reconnu comme nom d’applet de commande, fonction, fichier de script ou programme
exécutable. Vérifiez l’orthographe du nom, ou si un chemin d’accès existe, vérifiez que le chemin d’accès est correct et
réessayez.
Au caractère Ligne:1 : 1

  • Run with --info
  •   + CategoryInfo          : ObjectNotFound: (Run:String) [], CommandNotFoundException
      + FullyQualifiedErrorId : CommandNotFoundException
    
    

Quand j’ai lancE la commande on m’a ecrit de la sorte

Essayez de créer un projet Flutter vierge puis de rajouter les fichier dart dans ce nouveau projet.

comment ajouter les fichiers dans c projet?