Erreur quand j'excute mon projet

/Applications/flutter/.pub-cache/hosted/pub.dartlang.org/firebase_auth_platform_interface-6.2.0/lib/src/method_channel/utils/exception.dart:17:9: Error: Method not found: ‹ Error.throwWithStackTrace ›.
Error.throwWithStackTrace(
^^^^^^^^^^^^^^^^^^^
/Applications/flutter/.pub-cache/hosted/pub.dartlang.org/firebase_auth_platform_interface-6.2.0/lib/src/method_channel/utils/exception.dart:12:7: Error: A non-null value must be returned since the return type ‹ Never › doesn’t allow null.

Never convertPlatformException(Object exception, StackTrace stackTrace) {
^

FAILURE: Build failed with an exception.

  • Where:
    Script ‹ /Applications/flutter/packages/flutter_tools/gradle/flutter.gradle › line: 1005

  • What went wrong:
    Execution failed for task ‹ :app:compileFlutterBuildDebug ›.

Process ‹ command ‹ /Applications/flutter/bin/flutter › › finished with non-zero exit value 1

  • Try:

Run with --stacktrace option to get the stack trace.
Run with --info or --debug option to get more log output.
Run with --scan to get full insights.

BUILD FAILED in 54s
Exception: Gradle task assembleDebug failed with exit code 1
Exited (sigterm)

Bonjour,

Pouvez en dire plus sur comment se passe l’erreur ?
Arrivez-vous à lancer un projet Flutter de base ?
L’erreur semble concerner un package : firebase_auth_platform ? Est-il correctement implémenté ? Pouvez-vous l’enlever pour voir si le projet se lance correctement ?